{"text_format":"1","workbook":"xlsx","n_sheets":14,"sheets":["_SurveyPartMetadata","Tenant_Satisfaction_Measures_Re","Sect 1a - Background","Sect 1b - Background","Sect 2 - Published TSMs","Sect 3 - TSMs reported by all","Sect 4 - TSMs reported for LCRA","Sect 5 - TSMs reported for LCHO","Sect 6 - TSMs reported Combined","Validations","Lists","DimensionalMembers","PriorValues","OtherSurveyValues"],"not_rendered":{"charts":0,"images":0,"macros":1,"external_links":0,"defined_names":478,"comments":0,"pivot_tables":0},"unopened":[],"bounds":{"document_bytes":16777216,"sheet_cells":100000,"rows_first":2000,"rows_last":500,"rows_between":2000,"halvings":0,"cell_chars":16384,"cell_head_chars":4096},"cells_cut":0,"cells_raw":0,"read":"whole","date_system":"1900"}

{"sheet":"_SurveyPartMetadata","index":0,"n_rows":7,"n_cols":2,"rows_kept":7,"cut":false,"hidden":true,"merged":[]}
["Survey Name:","Tenant Satisfaction Measures Return (TSMs)"]
["Survey ID:",31]
["Survey Part Name:","Tenant Satisfaction Measures Return"]
["Survey Part ID:",52]
["Submission Part ID:",63909]
["Provider ID:",9749]
["Time Period ID:",15]

{"sheet":"Tenant_Satisfaction_Measures_Re","index":1,"n_rows":48,"n_cols":5,"rows_kept":48,"cut":false,"hidden":false,"merged":[[24,3,24,4],[19,3,19,4],[20,3,20,4],[21,3,21,4],[22,3,22,4],[23,3,23,4],[45,4,45,5],[47,4,47,5],[31,3,31,5],[1,1,1,3],[3,1,3,4],[11,1,11,3],[15,3,15,4],[16,3,16,4],[29,3,29,5],[30,3,30,5],[32,3,32,5],[37,3,37,5],[38,3,38,5],[39,3,39,5],[17,3,17,4],[18,3,18,4]]}
[]
[null,"NROSH+ 2024"]
[]
[null,"Spreadsheet Import Template"]
[]
[null,null,null,"Version:"]
[null,null,null,"Latest Issue Date:"]
[]
{"$rows_left_out":41}
{"sheet":"Sect 1a - Background","index":2,"n_rows":76,"n_cols":6,"rows_kept":76,"cut":false,"hidden":false,"merged":[[69,1,69,9],[40,4,40,5],[10,2,12,2],[63,2,63,3],[27,2,27,3],[28,2,28,3],[25,4,25,5],[10,5,12,9],[18,1,18,9],[13,2,16,2],[21,2,21,3],[23,2,23,3],[25,2,25,3],[75,2,75,3],[75,4,78,5],[30,2,30,3],[31,2,31,3],[33,2,33,3],[73,2,73,3],[34,2,34,3],[34,4,37,5],[39,2,39,3],[40,2,40,3],[47,2,47,3],[49,2,49,3],[51,2,51,3],[53,2,53,3],[71,2,71,5],[45,1,45,9],[2,1,2,9],[31,4,31,5],[3,2,3,5],[63,4,66,5],[7,1,7,9],[4,1,4,9],[5,1,5,9],[9,2,9,3]]}
[]
[]
[null,"Section 1a - Background"]
[]
[null,"This section allows for the collection of information relating to the tenant perception survey approach, sampling and methodology behind the collection and production of the tenant perception survey TSMs. "]
[null,"Note: If you are reporting tenant perception measures for both LCRA in section 4 and LCHO in section 5 independently you will need to complete this section and section 1b."]
[]
[null,"Survey completion"]
{"$rows_left_out":69}
{"sheet":"Sect 1b - Background","index":3,"n_rows":76,"n_cols":5,"rows_kept":76,"cut":false,"hidden":false,"merged":[[9,2,9,3],[21,2,21,3],[23,2,23,3],[25,2,25,3],[27,2,27,3],[53,2,53,3],[51,2,51,3],[30,2,30,3],[31,2,31,3],[47,2,47,3],[49,2,49,3],[2,1,2,9],[7,1,7,9],[18,1,18,9],[45,1,45,9],[25,4,25,5],[40,2,40,3],[31,4,31,5],[33,2,33,3],[34,2,34,3],[34,4,37,5],[39,2,39,3],[40,4,40,5],[4,1,4,9],[5,1,5,9],[28,2,28,3],[3,2,3,5],[63,2,63,3],[63,4,66,5],[69,1,69,9],[75,2,75,3],[75,4,78,5],[73,2,73,3],[71,2,71,5]]}
[]
[]
[null,"Section 1b - Background"]
[]
[null,"This section allows for the collection of information relating to the tenant perception survey approach, sampling and methodology behind the collection and production of the tenant perception survey TSMs. "]
[null,"Note: You should only complete this section (section 1b) if you are reporting tenant perception measures for both LCRA in section 4 and LCHO in section 5 independently. Please see guidance for more information."]
[]
[null,"Survey completion (taken from Sect 1a - Background)"]
{"$rows_left_out":69}
{"sheet":"Sect 2 - Published TSMs","index":4,"n_rows":84,"n_cols":7,"rows_kept":84,"cut":false,"hidden":false,"merged":[[11,2,11,3],[9,3,9,5],[11,6,11,7],[3,1,3,9],[4,1,4,9],[2,1,2,9],[73,6,75,6],[48,1,48,2],[31,1,31,2],[42,1,42,2],[5,1,5,5],[14,1,14,5],[18,3,18,5],[19,3,19,5],[29,3,29,5],[20,3,20,5],[22,1,22,5],[26,3,26,5],[33,1,33,5],[27,3,27,5],[28,3,28,5],[50,1,50,5],[69,1,69,5],[59,1,59,5],[57,1,57,2],[67,1,67,2]]}
[]
[]
[null,"Section 2 - Published TSMs"]
[null,"The TSMs reported in this table should match your published performance against the tenant satisfaction measures."]
[null,"You must complete the table below, filling in the correct columns based on the relevant social housing stock basis for which you have published your TSMs."]
[null,"Q1 Publication information"]
[]
[null,"Q1a","Have you published your performance against the TSMs?",null,null,"No"]
{"$rows_left_out":77}
{"sheet":"Sect 3 - TSMs reported by all","index":5,"n_rows":55,"n_cols":7,"rows_kept":55,"cut":false,"hidden":false,"merged":[[54,4,54,5],[52,4,52,5],[24,1,24,5],[25,1,25,5],[26,1,26,5],[29,2,29,5],[36,1,36,9],[28,2,28,6],[38,1,38,5],[42,2,42,5],[43,2,43,5],[40,2,40,5],[50,1,50,5],[2,1,2,9],[10,1,10,9],[12,2,12,9],[22,1,22,9],[3,1,3,4],[4,1,4,5],[13,2,13,5],[5,1,5,5],[7,2,7,4],[8,2,8,4],[8,5,8,8]]}
[]
[]
[null,"Section 3 - TSMs reported by all providers"]
[]
[null,"This section must be completed by all providers."]
[null,"Achieving the requirements for TSMs calculated for management information"]
[]
[null,"Q1a","Have you been able to achieve all of the requirements set out in the TSM technical requirements for TSMs calculated from management information?",null,null,"Yes"]
{"$rows_left_out":48}
{"sheet":"Sect 4 - TSMs reported for LCRA","index":6,"n_rows":86,"n_cols":9,"rows_kept":86,"cut":false,"hidden":false,"merged":[[44,6,44,7],[46,8,49,9],[38,6,39,7],[10,2,10,7],[3,1,3,4],[6,1,6,6],[8,1,8,4],[4,1,4,9],[9,2,9,7],[13,2,13,4],[15,2,15,4],[18,2,18,4],[18,5,19,5],[19,2,19,4],[18,6,19,7],[38,5,39,5],[36,2,36,4],[21,2,21,4],[35,5,36,5],[26,2,26,7],[27,2,27,7],[21,6,22,7],[35,6,36,7],[21,5,22,5],[22,2,22,4],[25,1,25,4],[30,2,30,4],[32,2,32,4],[2,1,2,9],[72,2,73,2],[85,2,85,8],[46,2,46,4],[46,5,49,7],[51,1,51,6],[53,1,53,5],[54,2,54,8],[55,2,55,8],[39,2,39,4],[42,1,42,4],[57,2,58,2],[70,2,70,8],[44,2,44,4],[38,2,38,4],[35,2,35,4]]}
[]
[]
[null,"Section 4 - TSMs reported for low cost rental accommodation (LCRA) stock"]
[]
[null,"This section allows for the collection of the TSMs relating to LCRA dwelling stock and the information providing the context for these measures."]
[]
[null,"Complaints TSMs"]
[]
{"$rows_left_out":79}
{"sheet":"Sect 5 - TSMs reported for LCHO","index":7,"n_rows":86,"n_cols":9,"rows_kept":86,"cut":false,"hidden":false,"merged":[[44,6,44,7],[46,8,49,9],[38,6,39,7],[10,2,10,7],[3,1,3,4],[4,1,4,9],[6,1,6,6],[8,1,8,4],[9,2,9,7],[13,2,13,4],[15,2,15,4],[18,2,18,4],[18,5,19,5],[19,2,19,4],[18,6,19,7],[38,5,39,5],[36,2,36,4],[21,2,21,4],[35,5,36,5],[26,2,26,7],[27,2,27,7],[21,6,22,7],[35,6,36,7],[21,5,22,5],[22,2,22,4],[25,1,25,4],[30,2,30,4],[32,2,32,4],[2,1,2,9],[72,2,73,2],[85,2,85,8],[46,2,46,4],[46,5,49,7],[51,1,51,6],[53,1,53,5],[54,2,54,8],[55,2,55,8],[39,2,39,4],[42,1,42,4],[57,2,58,2],[70,2,70,8],[44,2,44,4],[38,2,38,4],[35,2,35,4]]}
[]
[]
[null,"Section 5 - TSMs reported for low cost home ownership (LCHO) stock"]
[]
[null,"This section allows for the collection of the TSMs relating to LCHO dwelling stock and the information providing the context for these measures."]
[]
[null,"Complaints TSMs"]
[]
{"$rows_left_out":79}
{"sheet":"Sect 6 - TSMs reported Combined","index":8,"n_rows":87,"n_cols":9,"rows_kept":87,"cut":false,"hidden":false,"merged":[[27,2,27,7],[19,2,19,4],[3,1,3,4],[6,1,6,6],[8,1,8,4],[9,2,9,7],[10,2,10,7],[13,2,13,4],[15,2,15,4],[18,2,18,4],[18,5,19,5],[26,2,26,7],[18,6,19,7],[4,1,4,9],[86,2,86,8],[55,2,55,8],[38,2,38,4],[38,5,39,5],[39,2,39,4],[42,1,42,4],[44,2,44,4],[46,2,46,4],[46,5,49,7],[51,1,51,6],[53,1,53,5],[54,2,54,8],[38,6,39,7],[44,6,44,7],[46,8,49,9],[2,1,2,9],[56,2,56,8],[58,2,59,2],[71,2,71,8],[73,2,74,2],[36,2,36,4],[21,2,21,4],[21,5,22,5],[22,2,22,4],[25,1,25,4],[30,2,30,4],[32,2,32,4],[35,2,35,4],[35,5,36,5],[21,6,22,7],[35,6,36,7]]}
[]
[]
[null,"Section 6 - TSMs reported on a combined stock basis (LCRA and LCHO combined)"]
[]
[null,"This section allows for the collection of the TSMs relating to a combined LCRA and LCHO dwelling stock basis and the information providing the context for these measures."]
[]
[null,"Complaints TSMs"]
[]
{"$rows_left_out":80}
{"sheet":"Validations","index":9,"n_rows":436,"n_cols":8,"rows_kept":436,"cut":false,"hidden":false,"merged":[[0,0,0,3],[1,0,1,3],[2,0,2,3]]}
["Workbook Validations"]
["These are the validations which are active for the current workbook, and their current states. Some validations may not execute until the workbook is uploaded to NROSH+"]
["Required fields are marked with * - all other fields are optional. Click on the column header for more information"]
[]
[null,"Validation Reference*","Short text","Description","Help Text","Type*","Category","Formula*"]
[null,"V_TSM0014","Sect 1b Q7 Contract organisations","If Q7 is \"Yes\", then please complete Sect 1b Q7a. If the response to Q7 is \"No\", then leave Q7a blank.",null,"Hard",null,{"$f":"OR(AND(ISBLANK('Sect 1b - Background'!DP_TSML047)=TRUE,ISBLANK('Sect 1b - Background'!DP_TSML052)=TRUE,ISBLANK('Sect 1b - Background'!DP_TSML053)=TRUE),AND(ISBLANK('Sect 1b - Background'!DP_TSML047)=FALSE,'Sect 1b - Background'!DP_TSML052=\"No\",ISBLANK('Sect 1b - Background'!DP_TSML053)=TRUE),AND(ISBLANK('Sect 1b - Background'!DP_TSML047)=FALSE,'Sect 1b - Background'!DP_TSML052=\"Yes\",ISBLANK('Sect 1b - Background'!DP_TSML053)=FALSE))","v":true}]
[null,"V_TSM0015","Sect 1b Q8 Incentive","If Q8 is 'Yes', then please complete Sect 1b Q8a. If the response to Q8 is 'No', then leave Q8a blank.",null,"Hard",null,{"$f":"OR(AND(ISBLANK('Sect 1b - Background'!DP_TSML047)=TRUE,ISBLANK('Sect 1b - Background'!DP_TSML054)=TRUE,ISBLANK('Sect 1b - Background'!DP_TSML055)=TRUE),AND(ISBLANK('Sect 1b - Background'!DP_TSML047)=FALSE,'Sect 1b - Background'!DP_TSML054=\"No\",ISBLANK('Sect 1b - Background'!DP_TSML055)=TRUE),AND(ISBLANK('Sect 1b - Background'!DP_TSML047)=FALSE,'Sect 1b - Background'!DP_TSML054=\"Yes\",ISBLANK('Sect 1b - Background'!DP_TSML055)=FALSE))","v":true}]
[null,"V_TSM0016","Sect 1b Q9 Confirm upload of supporting document","If the response to Sect 1b Q9 is 'No', then please complete Sect 1b Q9a. If the response to Q9 is 'Yes', then leave Q9a blank.",null,"Hard",null,{"$f":"OR(AND(ISBLANK('Sect 1b - Background'!DP_TSML047)=TRUE,ISBLANK('Sect 1b - Background'!DP_TSML056)=TRUE,ISBLANK('Sect 1b - Background'!DP_TSML057)=TRUE),AND(ISBLANK('Sect 1b - Background'!DP_TSML047)=FALSE,'Sect 1b - Background'!DP_TSML056=\"Yes\",ISBLANK('Sect 1b - Background'!DP_TSML057)=TRUE),AND(ISBLANK('Sect 1b - Background'!DP_TSML047)=FALSE,'Sect 1b - Background'!DP_TSML056=\"No\",ISBLANK('Sect 1b - Background'!DP_TSML057)=FALSE))","v":true}]
{"$rows_left_out":429}
{"sheet":"Lists","index":10,"n_rows":14,"n_cols":8,"rows_kept":14,"cut":false,"hidden":true,"merged":[[1,0,1,7],[2,0,2,7]]}
["Lists"]
["These are the list types for the current workbook. Include the values from which you want providers to choose below the name of the list."]
["Blank items will be ignored - if you want to allow a blank entry edit the data dictionary so that the data point allows nulls."]
[]
["Approach","CensusSample","Coverage","Supportingdoc","Supportingdoc2","Weighting","YesNo","ConfirmWeighted"]
["Single point in time","Census","LCRA - section 4","Yes - I have uploaded the supporting documentation",null,"Age of respondent","Yes","Weighted"]
["Phased approach","Sample","LCHO - section 5","No - I have not uploaded the supporting documentation","Yes - I have uploaded a supporting document","Building type","No","Unweighted"]
["Rolling survey",null,"Combined - section 6",null,"No - I have not uploaded a supporting document","Entity"]
{"$rows_left_out":7}
{"sheet":"DimensionalMembers","index":11,"n_rows":9,"n_cols":301,"rows_kept":9,"cut":false,"hidden":true,"merged":[]}
["DIM_Year","2022","2023","2024","2025","2026","2027","2028","2029","2030","2031","2032","2033","2034","2035","2036","2037","2038","2039","2040","2041","2042","2043","2044","2045","2046","2047","2048","2049","2050","2051","2052","2053","2054","2055","2056","2057","2058","2059","2060","2061","2062","2063","2064","2065","2066","2067","2068","2069","2070","2071","2072"]
["DIM_LA_Code","Adur - E07000223","Amber Valley - E07000032","Arun - E07000224","Ashfield - E07000170","Ashford - E07000105","Babergh - E07000200","Barking and Dagenham - E09000002","Barnet - E09000003","Barnsley - E08000016","Basildon - E07000066","Basingstoke and Deane - E07000084","Bassetlaw - E07000171","Bath and North East Somerset - E06000022","Bedford - E06000055","Bexley - E09000004","Birmingham - E08000025","Blaby - E07000129","Blackburn with Darwen - E06000008","Blackpool - E06000009","Bolsover - E07000033","Bolton - E08000001","Boston - E07000136","Bournemouth Christchurch and Poole - E06000058","Bracknell Forest - E06000036","Bradford - E08000032","Braintree - E07000067","Breckland - E07000143","Brent - E09000005","Brentwood - E07000068","Brighton and Hove - E06000043","Bristol, City of - E06000023","Broadland - E07000144","Bromley - E09000006","Bromsgrove - E07000234","Broxbourne - E07000095","Broxtowe - E07000172","Buckinghamshire - E06000060","Burnley - E07000117","Bury - E08000002","Calderdale - E08000033","Cambridge - E07000008","Camden - E09000007","Cannock Chase - E07000192","Canterbury - E07000106","Castle Point - E07000069","Central Bedfordshire - E06000056","Charnwood - E07000130","Chelmsford - E07000070","Cheltenham - E07000078","Cherwell - E07000177","Cheshire East - E06000049","Cheshire West and Chester - E06000050","Chesterfield - E07000034","Chichester - E07000225","Chorley - E07000118","City of London - E09000001","Colchester - E07000071","Cornwall - E06000052","Cotswold - E07000079","County Durham - E06000047","Coventry - E08000026","Crawley - E07000226","Croydon - E09000008","Dacorum - E07000096","Darlington - E06000005","Dartford - E07000107","Derby - E06000015","Derbyshire Dales - E07000035","Doncaster - E08000017","Dorset - E06000059","Dover - E07000108","Dudley - E08000027","Ealing - E09000009","East Cambridgeshire - E07000009","East Devon - E07000040","East Hampshire - E07000085","East Hertfordshire - E07000242","East Lindsey - E07000137","East Riding of Yorkshire - E06000011","East Staffordshire - E07000193","East Suffolk - E07000244","Eastbourne - E07000061","Eastleigh - E07000086","Elmbridge - E07000207","Enfield - E09000010","Epping Forest - E07000072","Epsom and Ewell - E07000208","Erewash - E07000036","Exeter - E07000041","Fareham - E07000087","Fenland - E07000010","Folkestone and Hythe - E07000112","Forest of Dean - E07000080","Fylde - E07000119","Gateshead - E08000037","Gedling - E07000173","Gloucester - E07000081","Gosport - E07000088","Gravesham - E07000109","Great Yarmouth - E07000145","Greenwich - E09000011","Guildford - E07000209","Hackney - E09000012","Halton - E06000006","Hammersmith and Fulham - E09000013","Harborough - E07000131","Haringey - E09000014","Harlow - E07000073","Harrow - E09000015","Hart - E07000089","Hartlepool - E06000001","Hastings - E07000062","Havant - E07000090","Havering - E09000016","Herefordshire, County of - E06000019","Hertsmere - E07000098","High Peak - E07000037","Hillingdon - E09000017","Hinckley and Bosworth - E07000132","Horsham - E07000227","Hounslow - E09000018","Huntingdonshire - E07000011","Hyndburn - E07000120","Ipswich - E07000202","Isle of Wight - E06000046","Isles of Scilly - E06000053","Islington - E09000019","Kensington and Chelsea - E09000020","King's Lynn and West Norfolk - E07000146","Kingston upon Hull, City of - E06000010","Kingston upon Thames - E09000021","Kirklees - E08000034","Knowsley - E08000011","Lambeth - E09000022","Lancaster - E07000121","Leeds - E08000035","Leicester - E06000016","Lewes - E07000063","Lewisham - E09000023","Lichfield - E07000194","Lincoln - E07000138","Liverpool - E08000012","Luton - E06000032","Maidstone - E07000110","Maldon - E07000074","Malvern Hills - E07000235","Manchester - E08000003","Mansfield - E07000174","Medway - E06000035","Melton - E07000133","Merton - E09000024","Mid Devon - E07000042","Mid Suffolk - E07000203","Mid Sussex - E07000228","Middlesbrough - E06000002","Milton Keynes - E06000042","Mole Valley - E07000210","New Forest - E07000091","Newark and Sherwood - E07000175","Newcastle upon Tyne - E08000021","Newcastle-under-Lyme - E07000195","Newham - E09000025","North Devon - E07000043","North East Derbyshire - E07000038","North East Lincolnshire - E06000012","North Hertfordshire - E07000099","North Kesteven - E07000139","North Lincolnshire - E06000013","North Norfolk - E07000147","North Northamptonshire - E06000061","North Somerset - E06000024","North Tyneside - E08000022","North Warwickshire - E07000218","North West Leicestershire - E07000134","Northumberland - E06000057","Norwich - E07000148","Nottingham - E06000018","Nuneaton and Bedworth - E07000219","Oadby and Wigston - E07000135","Oldham - E08000004","Oxford - E07000178","Pendle - E07000122","Peterborough - E06000031","Plymouth - E06000026","Portsmouth - E06000044","Preston - E07000123","Reading - E06000038","Redbridge - E09000026","Redcar and Cleveland - E06000003","Redditch - E07000236","Reigate and Banstead - E07000211","Ribble Valley - E07000124","Richmond upon Thames - E09000027","Rochdale - E08000005","Rochford - E07000075","Rossendale - E07000125","Rother - E07000064","Rotherham - E08000018","Rugby - E07000220","Runnymede - E07000212","Rushcliffe - E07000176","Rushmoor - E07000092","Rutland - E06000017","Salford - E08000006","Sandwell - E08000028","Sefton - E08000014","Sevenoaks - E07000111","Sheffield - E08000019","Shropshire - E06000051","Slough - E06000039","Solihull - E08000029","South Cambridgeshire - E07000012","South Derbyshire - E07000039","South Gloucestershire - E06000025","South Hams - E07000044","South Holland - E07000140","South Kesteven - E07000141","South Norfolk - E07000149","South Oxfordshire - E07000179","South Ribble - E07000126","South Staffordshire - E07000196","South Tyneside - E08000023","Southampton - E06000045","Southend-on-Sea - E06000033","Southwark - E09000028","Spelthorne - E07000213","St Albans - E07000240","St. Helens - E08000013","Stafford - E07000197","Staffordshire Moorlands - E07000198","Stevenage - E07000243","Stockport - E08000007","Stockton-on-Tees - E06000004","Stoke-on-Trent - E06000021","Stratford-on-Avon - E07000221","Stroud - E07000082","Sunderland - E08000024","Surrey Heath - E07000214","Sutton - E09000029","Swale - E07000113","Swindon - E06000030","Tameside - E08000008","Tamworth - E07000199","Tandridge - E07000215","Teignbridge - E07000045","Telford and Wrekin - E06000020","Tendring - E07000076","Test Valley - E07000093","Tewkesbury - E07000083","Thanet - E07000114","Three Rivers - E07000102","Thurrock - E06000034","Tonbridge and Malling - E07000115","Torbay - E06000027","Torridge - E07000046","Tower Hamlets - E09000030","Trafford - E08000009","Tunbridge Wells - E07000116","Uttlesford - E07000077","Vale of White Horse - E07000180","Wakefield - E08000036","Walsall - E08000030","Waltham Forest - E09000031","Wandsworth - E09000032","Warrington - E06000007","Warwick - E07000222","Watford - E07000103","Waverley - E07000216","Wealden - E07000065","Welwyn Hatfield - E07000241","West Berkshire - E06000037","West Devon - E07000047","West Lancashire - E07000127","West Lindsey - E07000142","West Northamptonshire - E06000062","West Oxfordshire - E07000181","West Suffolk - E07000245","Westminster - E09000033","Wigan - E08000010","Wiltshire - E06000054","Winchester - E07000094","Windsor and Maidenhead - E06000040","Wirral - E08000015","Woking - E07000217","Wokingham - E06000041","Wolverhampton - E08000031","Worcester - E07000237","Worthing - E07000229","Wychavon - E07000238","Wyre - E07000128","Wyre Forest - E07000239","York - E06000014","Northern Ireland - N92000002","Outside UK - 9300000XX","Scotland - S92000003","Wales - W92000004","Cumberland - E06000063","North Yorkshire - E06000065","Somerset - E06000066","Westmorland and Furness - E06000064"]
["DIM_Counter_Party","abrdn (Standard Life Aberdeen)","Affordable Housing Finance","Allied Irish Banks","Aviva","Aviva (Friends Life)","Babson Capital","Bank of China","Bank of Ireland","Bank of New York Mellon","Bank of Scotland","Barclays","BlackRock","BNP Paribas","CAF","Canada Life","CCLA","Charity Bank","Close Brothers Group","Clydesdale/Yorkshire Bank/Virgin Money","The Co-operative Bank","Credit Suisse","Crown Mortgage Management","Danske","Darlington BS","DB Life Insurance","Deutsche Bank","Dexia","EIB","Federated Prime Rate","Funding for Homes Ltd","GBSH","Goldman Sachs","HACO","HAF","HALOS","Handelsbanken","Harbour","Haven","Helaba","HSBC","HSL","Ignis","Investec Fund Managers","JPMorgan","Kent Reliance BS","Leeds BS","Legal & General","Lloyds","Local authority","M&G (Prudential)","Macquarie","MetLife","Metro Bank","Millbank","Morgan Stanley","MORhomes","MUFG Bank (Mitsubishi)","My Home Finance","National Australia Bank Limited","Nationwide","Newbury BS","Newcastle BS","Norwich & Peterborough BS","Orchardbrook","Own name bond - retail","Own name bond - wholesale","Pricoa/PGIM","Reliance Bank","RBC","RBS/NatWest","Rothesay","RSL Finance","Saltaire Finance (Ara-Venn)","Santander","Scottish Widows","SMBC (Sumitomo Mitsui)","Standard Chartered Bank","Suffolk Building Society (Ipswich)","SWIP AAA fund","THFC","Triodos","Unity Trust Bank","Wells Fargo","Yorkshire BS","ABN - Amro","First Abu Dhabi (FAB)"]
["DIM_Property_Size_4Bed","Non-self-contained/Bedspace","Bedsit","1 Bedroom","2 Bedroom","3 Bedroom","4+ Bedroom"]
["DIM_Property_Size_6Bed","Non-self-contained/Bedspace","Bedsit","1 Bedroom","2 Bedroom","3 Bedroom","4 Bedroom","5 Bedroom","6+ Bedroom"]
["DIM_Relative_Year","Initial year","Initial year + 1","Initial year + 2","Initial year + 3","Initial year + 4","Initial year + 5","Initial year + 6","Initial year + 7","Initial year + 8","Initial year + 9"]
["DIM_Sequence","1","2","3","4","5","6","7","8","9","10","11","12","13","14","15","16","17","18","19","20","21","22","23","24","25","26","27","28","29","30","31","32","33","34","35","36","37","38","39","40","41","42","43","44","45","46","47","48","49","50","51","52","53","54","55","56","57","58","59","60","61","62","63","64","65","66","67","68","69","70","71","72","73","74","75","76","77","78","79","80","81","82","83","84","85","86","87","88","89","90","91","92","93","94","95","96","97","98","99","100","101","102","103","104","105","106","107","108","109","110","111","112","113","114","115","116","117","118","119","120","121","122","123","124","125","126","127","128","129","130","131","132","133","134","135","136","137","138","139","140","141","142","143","144","145","146","147","148","149","150"]
["DIM_Forecast_Year","FY_01","FY_02","FY_03","FY_04","FY_05","FY_06","FY_07","FY_08","FY_09","FY_10","FY_11","FY_12","FY_13","FY_14","FY_15","FY_16","FY_17","FY_18","FY_19","FY_20","FY_21","FY_22","FY_23","FY_24","FY_25","FY_26","FY_27","FY_28","FY_29","FY_30"]
{"$rows_left_out":2}
{"sheet":"PriorValues","index":12,"n_rows":4,"n_cols":4,"rows_kept":4,"cut":false,"hidden":true,"merged":[[0,0,0,3],[1,0,1,3]]}
["Prior Value Cache"]
["Warning - This is a hidden system sheet, pleae do not modify it or you will break any references to prior period / prior year values"]
[]
[null,"DataPointId","PriorPeriodValue","PriorYearValue"]

{"sheet":"OtherSurveyValues","index":13,"n_rows":4,"n_cols":5,"rows_kept":4,"cut":false,"hidden":true,"merged":[[0,0,0,3],[1,0,1,3]]}
["Other Survey Value Cache"]
["Warning - This is a hidden system sheet, pleae do not modify it or you will break any references to other survey values"]
[]
[null,"DataPointId","SurveyId","TimePeriodId","Value"]